KTrafficAnalyzer-0.3.8-1 on RHEL 4 AS

Discussion regarding the installation and configuration of Linux distributions.

KTrafficAnalyzer-0.3.8-1 on RHEL 4 AS

Postby AcidEYE » Fri Jul 13, 2007 7:58 pm

Asalam U Alikum,
while installing KTrafficAnalyzer on RHEL 4AS it give following error please somebody help me in this
thanks & regard


root@server KTrafficAnalyzer-0.3.8-1]# make
if test "/usr" = ""; then echo KDEDIR not set!; exit 1; fi;
if test "/usr/lib/qt-3.3" = ""; then echo QTDIR not set!; exit 1; fi;
for i in settings stats lib; do make -C $i SRC_ROOT=/tmp/KTrafficAnalyzer-0.3.8-1 "CFLAGS= -I/usr/lib/qt-3.3/include/ -I/usr/include/ -I/tmp/KTrafficAnalyzer-0.3.8-1" "MOC=/usr/lib/qt-3.3/bin/moc" "UIC=/usr/lib/qt-3.3/bin/uic"; done
make[1]: Entering directory `/tmp/KTrafficAnalyzer-0.3.8-1/settings'
kconfig_compiler KTASettings.kcfg KTASettings.kcfgc
gcc -c KTASettings.cpp -I/usr/lib/qt-3.3/include/ -I/usr/include/ -I/tmp/KTrafficAnalyzer-0.3.8-1
In file included from KTASettings.cpp:4:
KTASettings.h:6:29: kconfigskeleton.h: No such file or directory
In file included from KTASettings.cpp:4:
KTASettings.h:9: error: expected class-name before '{' token
KTASettings.h:266: error: expected `,' or `...' before '&' token
KTASettings.h:267: error: ISO C++ forbids declaration of `QString' with no type
KTASettings.h:276: error: `QString' does not name a type
KTASettings.h:342: error: expected `,' or `...' before '&' token
KTASettings.h:343: error: ISO C++ forbids declaration of `QString' with no type
KTASettings.h:352: error: `QString' does not name a type
KTASettings.h:361: error: expected `,' or `...' before '&' token
KTASettings.h:362: error: ISO C++ forbids declaration of `QString' with no type
KTASettings.h:371: error: `QString' does not name a type
KTASettings.h:380: error: expected `,' or `...' before '&' token
KTASettings.h:381: error: ISO C++ forbids declaration of `QString' with no type
KTASettings.h:390: error: `QString' does not name a type
KTASettings.h:399: error: expected `,' or `...' before '&' token
KTASettings.h:400: error: ISO C++ forbids declaration of `QString' with no type
KTASettings.h:409: error: `QString' does not name a type
KTASettings.h:437: error: expected `,' or `...' before '&' token
KTASettings.h:438: error: ISO C++ forbids declaration of `QColor' with no type
KTASettings.h:447: error: `QColor' does not name a type
KTASettings.h:456: error: expected `,' or `...' before '&' token
KTASettings.h:457: error: ISO C++ forbids declaration of `QColor' with no type
KTASettings.h:466: error: `QColor' does not name a type
KTASettings.h:475: error: expected `,' or `...' before '&' token
KTASettings.h:476: error: ISO C++ forbids declaration of `QColor' with no type
KTASettings.h:485: error: `QColor' does not name a type
KTASettings.h:494: error: expected `,' or `...' before '&' token
KTASettings.h:495: error: ISO C++ forbids declaration of `QColor' with no type
KTASettings.h:504: error: `QColor' does not name a type
KTASettings.h:532: error: expected `,' or `...' before '&' token
KTASettings.h:533: error: ISO C++ forbids declaration of `QFont' with no type
KTASettings.h:542: error: `QFont' does not name a type
KTASettings.h:551: error: expected `,' or `...' before '&' token
KTASettings.h:552: error: ISO C++ forbids declaration of `QFont' with no type
KTASettings.h:561: error: `QFont' does not name a type
KTASettings.h:592: error: `QString' does not name a type
KTASettings.h:598: error: `QString' does not name a type
KTASettings.h:599: error: `QString' does not name a type
KTASettings.h:600: error: `QString' does not name a type
KTASettings.h:601: error: `QString' does not name a type
KTASettings.h:605: error: `QColor' does not name a type
KTASettings.h:606: error: `QColor' does not name a type
KTASettings.h:607: error: `QColor' does not name a type
KTASettings.h:608: error: `QColor' does not name a type
KTASettings.h:612: error: `QFont' does not name a type
KTASettings.h:613: error: `QFont' does not name a type
KTASettings.h: In static member function `static void KTASettings::setNoBorder(bool)':
KTASettings.h:21: error: 'class KTASettings' has no member named 'isImmutable'
KTASettings.h:21: error: `QString' has not been declared
KTASettings.h:21: error: `fromLatin1' undeclared (first use this function)
KTASettings.h:21: error: (Each undeclared identifier is reported only once for each function itappears in.)
KTASettings.h: In static member function `static void KTASettings::setAlwaysOnTop(bool)':
KTASettings.h:40: error: 'class KTASettings' has no member named 'isImmutable'
KTASettings.h:40: error: `QString' has not been declared
KTASettings.h:40: error: `fromLatin1' undeclared (first use this function)
KTASettings.h: In static member function `static void KTASettings::setShowOnAllDesktops(bool)':
KTASettings.h:59: error: 'class KTASettings' has no member named 'isImmutable'
KTASettings.h:59: error: `QString' has not been declared
KTASettings.h:59: error: `fromLatin1' undeclared (first use this function)
KTASettings.h: In static member function `static void KTASettings::setSkipTaskBar(bool)':
KTASettings.h:78: error: 'class KTASettings' has no member named 'isImmutable'
KTASettings.h:78: error: `QString' has not been declared
KTASettings.h:78: error: `fromLatin1' undeclared (first use this function)
KTASettings.h: In static member function `static void KTASettings::setStartMinimized(bool)':
KTASettings.h:97: error: 'class KTASettings' has no member named 'isImmutable'
KTASettings.h:97: error: `QString' has not been declared
KTASettings.h:97: error: `fromLatin1' undeclared (first use this function)
KTASettings.h: In static member function `static void KTASettings::setRememberPos(bool)':
KTASettings.h:116: error: 'class KTASettings' has no member named 'isImmutable'
KTASettings.h:116: error: `QString' has not been declared
KTASettings.h:116: error: `fromLatin1' undeclared (first use this function)
KTASettings.h: In static member function `static void KTASettings::setRememberSize(bool)':
KTASettings.h:135: error: 'class KTASettings' has no member named 'isImmutable'
KTASettings.h:135: error: `QString' has not been declared
KTASettings.h:135: error: `fromLatin1' undeclared (first use this function)
KTASettings.h: In static member function `static void KTASettings::setShowToolBar(bool)':
KTASettings.h:154: error: 'class KTASettings' has no member named 'isImmutable'
KTASettings.h:154: error: `QString' has not been declared
KTASettings.h:154: error: `fromLatin1' undeclared (first use this function)
KTASettings.h: In static member function `static void KTASettings::setPosX(int)':
KTASettings.h:173: error: 'class KTASettings' has no member named 'isImmutable'
KTASettings.h:173: error: `QString' has not been declared
KTASettings.h:173: error: `fromLatin1' undeclared (first use this function)
KTASettings.h: In static member function `static void KTASettings::setPosY(int)':
KTASettings.h:192: error: 'class KTASettings' has no member named 'isImmutable'
KTASettings.h:192: error: `QString' has not been declared
KTASettings.h:192: error: `fromLatin1' undeclared (first use this function)
KTASettings.h: In static member function `static void KTASettings::setSizeX(int)':
KTASettings.h:211: error: 'class KTASettings' has no member named 'isImmutable'
KTASettings.h:211: error: `QString' has not been declared
KTASettings.h:211: error: `fromLatin1' undeclared (first use this function)
KTASettings.h: In static member function `static void KTASettings::setSizeY(int)':
KTASettings.h:230: error: 'class KTASettings' has no member named 'isImmutable'
KTASettings.h:230: error: `QString' has not been declared
KTASettings.h:230: error: `fromLatin1' undeclared (first use this function)
KTASettings.h: In static member function `static void KTASettings::setInterfacesSource(int)':
KTASettings.h:249: error: 'class KTASettings' has no member named 'isImmutable'
KTASettings.h:249: error: `QString' has not been declared
KTASettings.h:249: error: `fromLatin1' undeclared (first use this function)
KTASettings.h: In static member function `static void KTASettings::setInterface(int)':
KTASettings.h:268: error: 'class KTASettings' has no member named 'isImmutable'
KTASettings.h:268: error: `QString' is not a class or namespace
KTASettings.h:268: error: `fromLatin1' undeclared (first use this function)
KTASettings.h:269: error: 'class KTASettings' has no member named 'mInterface'
KTASettings.h:269: error: `v' undeclared (first use this function)
KTASettings.h: In static member function `static void KTASettings::setMonitorTime(int)':
KTASettings.h:287: error: 'class KTASettings' has no member named 'isImmutable'
KTASettings.h:287: error: `QString' has not been declared
KTASettings.h:287: error: `fromLatin1' undeclared (first use this function)
KTASettings.h: In static member function `static void KTASettings::setRefreshTime(int)':
KTASettings.h:306: error: 'class KTASettings' has no member named 'isImmutable'
KTASettings.h:306: error: `QString' has not been declared
KTASettings.h:306: error: `fromLatin1' undeclared (first use this function)
KTASettings.h: In static member function `static void KTASettings::setAlwaysWriteStats(bool)':
KTASettings.h:325: error: 'class KTASettings' has no member named 'isImmutable'
KTASettings.h:325: error: `QString' has not been declared
KTASettings.h:325: error: `fromLatin1' undeclared (first use this function)
KTASettings.h: In static member function `static void KTASettings::setSSHHost(int)':
KTASettings.h:344: error: 'class KTASettings' has no member named 'isImmutable'
KTASettings.h:344: error: `QString' is not a class or namespace
KTASettings.h:344: error: `fromLatin1' undeclared (first use this function)
KTASettings.h:345: error: 'class KTASettings' has no member named 'mSSHHost'
KTASettings.h:345: error: `v' undeclared (first use this function)
KTASettings.h: In static member function `static void KTASettings::setSSHUser(int)':
KTASettings.h:363: error: 'class KTASettings' has no member named 'isImmutable'
KTASettings.h:363: error: `QString' is not a class or namespace
KTASettings.h:363: error: `fromLatin1' undeclared (first use this function)
KTASettings.h:364: error: 'class KTASettings' has no member named 'mSSHUser'
KTASettings.h:364: error: `v' undeclared (first use this function)
KTASettings.h: In static member function `static void KTASettings::setSSHPass(int)':
KTASettings.h:382: error: 'class KTASettings' has no member named 'isImmutable'
KTASettings.h:382: error: `QString' is not a class or namespace
KTASettings.h:382: error: `fromLatin1' undeclared (first use this function)
KTASettings.h:383: error: 'class KTASettings' has no member named 'mSSHPass'
KTASettings.h:383: error: `v' undeclared (first use this function)
KTASettings.h: In static member function `static void KTASettings::setSSHParameter(int)':
KTASettings.h:401: error: 'class KTASettings' has no member named 'isImmutable'
KTASettings.h:401: error: `QString' is not a class or namespace
KTASettings.h:401: error: `fromLatin1' undeclared (first use this function)
KTASettings.h:402: error: 'class KTASettings' has no member named 'mSSHParameter'
KTASettings.h:402: error: `v' undeclared (first use this function)
KTASettings.h: In static member function `static void KTASettings::setSSHDebug(bool)':
KTASettings.h:420: error: 'class KTASettings' has no member named 'isImmutable'
KTASettings.h:420: error: `QString' has not been declared
KTASettings.h:420: error: `fromLatin1' undeclared (first use this function)
KTASettings.h: In static member function `static void KTASettings::setUploadColor(int)':
KTASettings.h:439: error: 'class KTASettings' has no member named 'isImmutable'
KTASettings.h:439: error: `QString' has not been declared
KTASettings.h:439: error: `fromLatin1' undeclared (first use this function)
KTASettings.h:440: error: 'class KTASettings' has no member named 'mUploadColor'
KTASettings.h:440: error: `v' undeclared (first use this function)
KTASettings.h: In static member function `static void KTASettings::setDownloadColor(int)':
KTASettings.h:458: error: 'class KTASettings' has no member named 'isImmutable'
KTASettings.h:458: error: `QString' has not been declared
KTASettings.h:458: error: `fromLatin1' undeclared (first use this function)
KTASettings.h:459: error: 'class KTASettings' has no member named 'mDownloadColor'
KTASettings.h:459: error: `v' undeclared (first use this function)
KTASettings.h: In static member function `static void KTASettings::setBackgroundColor(int)':
KTASettings.h:477: error: 'class KTASettings' has no member named 'isImmutable'
KTASettings.h:477: error: `QString' has not been declared
KTASettings.h:477: error: `fromLatin1' undeclared (first use this function)
KTASettings.h:478: error: 'class KTASettings' has no member named 'mBackgroundColor'
KTASettings.h:478: error: `v' undeclared (first use this function)
KTASettings.h: In static member function `static void KTASettings::setGridColor(int)':
KTASettings.h:496: error: 'class KTASettings' has no member named 'isImmutable'
KTASettings.h:496: error: `QString' has not been declared
KTASettings.h:496: error: `fromLatin1' undeclared (first use this function)
KTASettings.h:497: error: 'class KTASettings' has no member named 'mGridColor'
KTASettings.h:497: error: `v' undeclared (first use this function)
KTASettings.h: In static member function `static void KTASettings::setSbUsesBGColor(bool)':
KTASettings.h:515: error: 'class KTASettings' has no member named 'isImmutable'
KTASettings.h:515: error: `QString' has not been declared
KTASettings.h:515: error: `fromLatin1' undeclared (first use this function)
KTASettings.h: In static member function `static void KTASettings::setStatusBarFont(int)':
KTASettings.h:534: error: 'class KTASettings' has no member named 'isImmutable'
KTASettings.h:534: error: `QString' has not been declared
KTASettings.h:534: error: `fromLatin1' undeclared (first use this function)
KTASettings.h:535: error: 'class KTASettings' has no member named 'mStatusBarFont'
KTASettings.h:535: error: `v' undeclared (first use this function)
KTASettings.h: In static member function `static void KTASettings::setMenuBarFont(int)':
KTASettings.h:553: error: 'class KTASettings' has no member named 'isImmutable'
KTASettings.h:553: error: `QString' has not been declared
KTASettings.h:553: error: `fromLatin1' undeclared (first use this function)
KTASettings.h:554: error: 'class KTASettings' has no member named 'mMenuBarFont'
KTASettings.h:554: error: `v' undeclared (first use this function)
KTASettings.h: In static member function `static void KTASettings::writeConfig()':
KTASettings.h:569: error: `KConfigSkeleton' has not been declared
KTASettings.h:569: error: expected `>' before '*' token
KTASettings.h:569: error: expected `(' before '*' token
KTASettings.h:569: error: expected primary-expression before '>' token
KTASettings.h:569: error: expected `)' before ';' token
KTASettings.cpp:6:28: kstaticdeleter.h: No such file or directory
KTASettings.cpp: At global scope:
KTASettings.cpp:9: error: expected init-declarator before '<' token
KTASettings.cpp:9: error: expected `,' or `;' before '<' token
KTASettings.cpp: In static member function `static KTASettings* KTASettings::self()':
KTASettings.cpp:14: error: `staticKTASettingsDeleter' undeclared (first use this function)
KTASettings.cpp:15: error: 'class KTASettings' has no member named 'readConfig'
KTASettings.cpp: In constructor `KTASettings::KTASettings()':
KTASettings.cpp:22: error: class `KTASettings' does not have any field named `KConfigSkeleton'
KTASettings.cpp:22: error: `QString' has not been declared
KTASettings.cpp:22: error: `fromLatin1' undeclared (first use this function)
KTASettings.cpp:25: error: `QString' has not been declared
KTASettings.cpp:25: error: `setCurrentGroup' undeclared (first use this function)
KTASettings.cpp:27: error: `KConfigSkeleton' has not been declared
KTASettings.cpp:27: error: `ItemBool' undeclared (first use this function)
KTASettings.cpp:27: error: `itemnoBorder' undeclared (first use this function)
KTASettings.cpp:28: error: `KConfigSkeleton' has not been declared
KTASettings.cpp:28: error: `ItemBool' has not been declared
KTASettings.cpp:28: error: `currentGroup' undeclared (first use this function)
KTASettings.cpp:28: error: `QString' has not been declared
KTASettings.cpp:29: error: `QString' has not been declared
KTASettings.cpp:29: error: `addItem' undeclared (first use this function)
KTASettings.cpp:30: error: `KConfigSkeleton' has not been declared
KTASettings.cpp:30: error: `itemalwaysOnTop' undeclared (first use this function)
KTASettings.cpp:31: error: `KConfigSkeleton' has not been declared
KTASettings.cpp:31: error: `ItemBool' has not been declared
KTASettings.cpp:31: error: `QString' has not been declared
KTASettings.cpp:32: error: `QString' has not been declared
KTASettings.cpp:33: error: `KConfigSkeleton' has not been declared
KTASettings.cpp:33: error: `itemshowOnAllDesktops' undeclared (first use this function)
KTASettings.cpp:34: error: `KConfigSkeleton' has not been declared
KTASettings.cpp:34: error: `ItemBool' has not been declared
KTASettings.cpp:34: error: `QString' has not been declared
KTASettings.cpp:35: error: `QString' has not been declared
KTASettings.cpp:36: error: `KConfigSkeleton' has not been declared
KTASettings.cpp:36: error: `itemskipTaskBar' undeclared (first use this function)
KTASettings.cpp:37: error: `KConfigSkeleton' has not been declared
KTASettings.cpp:37: error: `ItemBool' has not been declared
KTASettings.cpp:37: error: `QString' has not been declared
KTASettings.cpp:38: error: `QString' has not been declared
KTASettings.cpp:39: error: `KConfigSkeleton' has not been declared
KTASettings.cpp:39: error: `itemstartMinimized' undeclared (first use this function)
KTASettings.cpp:40: error: `KConfigSkeleton' has not been declared
KTASettings.cpp:40: error: `ItemBool' has not been declared
KTASettings.cpp:40: error: `QString' has not been declared
KTASettings.cpp:41: error: `QString' has not been declared
KTASettings.cpp:42: error: `KConfigSkeleton' has not been declared
KTASettings.cpp:42: error: `itemrememberPos' undeclared (first use this function)
KTASettings.cpp:43: error: `KConfigSkeleton' has not been declared
KTASettings.cpp:43: error: `ItemBool' has not been declared
KTASettings.cpp:43: error: `QString' has not been declared
KTASettings.cpp:44: error: `QString' has not been declared
KTASettings.cpp:45: error: `KConfigSkeleton' has not been declared
KTASettings.cpp:45: error: `itemrememberSize' undeclared (first use this function)
KTASettings.cpp:46: error: `KConfigSkeleton' has not been declared
KTASettings.cpp:46: error: `ItemBool' has not been declared
KTASettings.cpp:46: error: `QString' has not been declared
KTASettings.cpp:47: error: `QString' has not been declared
KTASettings.cpp:48: error: `KConfigSkeleton' has not been declared
KTASettings.cpp:48: error: `itemshowToolBar' undeclared (first use this function)
KTASettings.cpp:49: error: `KConfigSkeleton' has not been declared
KTASettings.cpp:49: error: `ItemBool' has not been declared
KTASettings.cpp:49: error: `QString' has not been declared
KTASettings.cpp:50: error: `QString' has not been declared
KTASettings.cpp:51: error: `KConfigSkeleton' has not been declared
KTASettings.cpp:51: error: `ItemInt' undeclared (first use this function)
KTASettings.cpp:51: error: `itemposX' undeclared (first use this function)
KTASettings.cpp:52: error: `KConfigSkeleton' has not been declared
KTASettings.cpp:52: error: `ItemInt' has not been declared
KTASettings.cpp:52: error: `QString' has not been declared
KTASettings.cpp:53: error: `QString' has not been declared
KTASettings.cpp:54: error: `KConfigSkeleton' has not been declared
KTASettings.cpp:54: error: `itemposY' undeclared (first use this function)
KTASettings.cpp:55: error: `KConfigSkeleton' has not been declared
KTASettings.cpp:55: error: `ItemInt' has not been declared
KTASettings.cpp:55: error: `QString' has not been declared
KTASettings.cpp:56: error: `QString' has not been declared
KTASettings.cpp:57: error: `KConfigSkeleton' has not been declared
KTASettings.cpp:57: error: `itemsizeX' undeclared (first use this function)
KTASettings.cpp:58: error: `KConfigSkeleton' has not been declared
KTASettings.cpp:58: error: `ItemInt' has not been declared
KTASettings.cpp:58: error: `QString' has not been declared
KTASettings.cpp:59: error: `QString' has not been declared
KTASettings.cpp:60: error: `KConfigSkeleton' has not been declared
KTASettings.cpp:60: error: `itemsizeY' undeclared (first use this function)
KTASettings.cpp:61: error: `KConfigSkeleton' has not been declared
KTASettings.cpp:61: error: `ItemInt' has not been declared
KTASettings.cpp:61: error: `QString' has not been declared
KTASettings.cpp:62: error: `QString' has not been declared
KTASettings.cpp:64: error: `QString' has not been declared
KTASettings.cpp:66: error: `KConfigSkeleton' has not been declared
KTASettings.cpp:66: error: `iteminterfacesSource' undeclared (first use this function)
KTASettings.cpp:67: error: `KConfigSkeleton' has not been declared
KTASettings.cpp:67: error: `ItemInt' has not been declared
KTASettings.cpp:67: error: `QString' has not been declared
KTASettings.cpp:68: error: `QString' has not been declared
KTASettings.cpp:69: error: `KConfigSkeleton' has not been declared
KTASettings.cpp:69: error: `ItemString' undeclared (first use this function)
KTASettings.cpp:69: error: `itemInterface' undeclared (first use this function)
KTASettings.cpp:70: error: `KConfigSkeleton' has not been declared
KTASettings.cpp:70: error: `ItemString' has not been declared
KTASettings.cpp:70: error: `QString' has not been declared
KTASettings.cpp:70: error: `mInterface' undeclared (first use this function)
KTASettings.cpp:71: error: `QString' has not been declared
KTASettings.cpp:72: error: `KConfigSkeleton' has not been declared
KTASettings.cpp:72: error: `itemMonitorTime' undeclared (first use this function)
KTASettings.cpp:73: error: `KConfigSkeleton' has not been declared
KTASettings.cpp:73: error: `ItemInt' has not been declared
KTASettings.cpp:73: error: `QString' has not been declared
KTASettings.cpp:74: error: `QString' has not been declared
KTASettings.cpp:75: error: `KConfigSkeleton' has not been declared
KTASettings.cpp:75: error: `itemRefreshTime' undeclared (first use this function)
KTASettings.cpp:76: error: `KConfigSkeleton' has not been declared
KTASettings.cpp:76: error: `ItemInt' has not been declared
KTASettings.cpp:76: error: `QString' has not been declared
KTASettings.cpp:77: error: `QString' has not been declared
KTASettings.cpp:78: error: `KConfigSkeleton' has not been declared
KTASettings.cpp:78: error: `itemalwaysWriteStats' undeclared (first use this function)
KTASettings.cpp:79: error: `KConfigSkeleton' has not been declared
KTASettings.cpp:79: error: `ItemBool' has not been declared
KTASettings.cpp:79: error: `QString' has not been declared
KTASettings.cpp:80: error: `QString' has not been declared
KTASettings.cpp:82: error: `QString' has not been declared
KTASettings.cpp:84: error: `KConfigSkeleton' has not been declared
KTASettings.cpp:84: error: `itemSSHHost' undeclared (first use this function)
KTASettings.cpp:85: error: `KConfigSkeleton' has not been declared
KTASettings.cpp:85: error: `ItemString' has not been declared
KTASettings.cpp:85: error: `QString' has not been declared
KTASettings.cpp:85: error: `mSSHHost' undeclared (first use this function)
KTASettings.cpp:86: error: `QString' has not been declared
KTASettings.cpp:87: error: `KConfigSkeleton' has not been declared
KTASettings.cpp:87: error: `itemSSHUser' undeclared (first use this function)
KTASettings.cpp:88: error: `KConfigSkeleton' has not been declared
KTASettings.cpp:88: error: `ItemString' has not been declared
KTASettings.cpp:88: error: `QString' has not been declared
KTASettings.cpp:88: error: `mSSHUser' undeclared (first use this function)
KTASettings.cpp:89: error: `QString' has not been declared
KTASettings.cpp:90: error: `KConfigSkeleton' has not been declared
KTASettings.cpp:90: error: `itemSSHPass' undeclared (first use this function)
KTASettings.cpp:91: error: `KConfigSkeleton' has not been declared
KTASettings.cpp:91: error: `ItemString' has not been declared
KTASettings.cpp:91: error: `QString' has not been declared
KTASettings.cpp:91: error: `mSSHPass' undeclared (first use this function)
KTASettings.cpp:92: error: `QString' has not been declared
KTASettings.cpp:93: error: `KConfigSkeleton' has not been declared
KTASettings.cpp:93: error: `itemSSHParameter' undeclared (first use this function)
KTASettings.cpp:94: error: `KConfigSkeleton' has not been declared
KTASettings.cpp:94: error: `ItemString' has not been declared
KTASettings.cpp:94: error: `QString' has not been declared
KTASettings.cpp:94: error: `mSSHParameter' undeclared (first use this function)
KTASettings.cpp:95: error: `QString' has not been declared
KTASettings.cpp:96: error: `KConfigSkeleton' has not been declared
KTASettings.cpp:96: error: `itemSSHDebug' undeclared (first use this function)
KTASettings.cpp:97: error: `KConfigSkeleton' has not been declared
KTASettings.cpp:97: error: `ItemBool' has not been declared
KTASettings.cpp:97: error: `QString' has not been declared
KTASettings.cpp:98: error: `QString' has not been declared
KTASettings.cpp:100: error: `QString' has not been declared
KTASettings.cpp:102: error: `KConfigSkeleton' has not been declared
KTASettings.cpp:102: error: `ItemColor' undeclared (first use this function)
KTASettings.cpp:102: error: `itemuploadColor' undeclared (first use this function)
KTASettings.cpp:103: error: `KConfigSkeleton' has not been declared
KTASettings.cpp:103: error: `ItemColor' has not been declared
KTASettings.cpp:103: error: `QString' has not been declared
KTASettings.cpp:103: error: `mUploadColor' undeclared (first use this function)
KTASettings.cpp:103: error: `QColor' undeclared (first use this function)
KTASettings.cpp:104: error: `QString' has not been declared
KTASettings.cpp:105: error: `KConfigSkeleton' has not been declared
KTASettings.cpp:105: error: `itemdownloadColor' undeclared (first use this function)
KTASettings.cpp:106: error: `KConfigSkeleton' has not been declared
KTASettings.cpp:106: error: `ItemColor' has not been declared
KTASettings.cpp:106: error: `QString' has not been declared
KTASettings.cpp:106: error: `mDownloadColor' undeclared (first use this function)
KTASettings.cpp:107: error: `QString' has not been declared
KTASettings.cpp:108: error: `KConfigSkeleton' has not been declared
KTASettings.cpp:108: error: `itembackgroundColor' undeclared (first use this function)
KTASettings.cpp:109: error: `KConfigSkeleton' has not been declared
KTASettings.cpp:109: error: `ItemColor' has not been declared
KTASettings.cpp:109: error: `QString' has not been declared
KTASettings.cpp:109: error: `mBackgroundColor' undeclared (first use this function)
KTASettings.cpp:109: error: `KGlobal' has not been declared
KTASettings.cpp:109: error: `config' undeclared (first use this function)
KTASettings.cpp:109: error: `KConfigGroup' undeclared (first use this function)
KTASettings.cpp:109: error: `QColor' has not been declared
KTASettings.cpp:110: error: `QString' has not been declared
KTASettings.cpp:111: error: `KConfigSkeleton' has not been declared
KTASettings.cpp:111: error: `itemgridColor' undeclared (first use this function)
KTASettings.cpp:112: error: `KConfigSkeleton' has not been declared
KTASettings.cpp:112: error: `ItemColor' has not been declared
KTASettings.cpp:112: error: `QString' has not been declared
KTASettings.cpp:112: error: `mGridColor' undeclared (first use this function)
KTASettings.cpp:113: error: `QString' has not been declared
KTASettings.cpp:114: error: `KConfigSkeleton' has not been declared
KTASettings.cpp:114: error: `itemsbUsesBGColor' undeclared (first use this function)
KTASettings.cpp:115: error: `KConfigSkeleton' has not been declared
KTASettings.cpp:115: error: `ItemBool' has not been declared
KTASettings.cpp:115: error: `QString' has not been declared
KTASettings.cpp:116: error: `QString' has not been declared
KTASettings.cpp:118: error: `QString' has not been declared
KTASettings.cpp:120: error: `KConfigSkeleton' has not been declared
KTASettings.cpp:120: error: `ItemFont' undeclared (first use this function)
KTASettings.cpp:120: error: `itemstatusBarFont' undeclared (first use this function)
KTASettings.cpp:121: error: `KConfigSkeleton' has not been declared
KTASettings.cpp:121: error: `ItemFont' has not been declared
KTASettings.cpp:121: error: `QString' has not been declared
KTASettings.cpp:121: error: `mStatusBarFont' undeclared (first use this function)
KTASettings.cpp:121: error: `KGlobalSettings' has not been declared
KTASettings.cpp:121: error: `toolBarFont' undeclared (first use this function)
KTASettings.cpp:122: error: `QString' has not been declared
KTASettings.cpp:123: error: `KConfigSkeleton' has not been declared
KTASettings.cpp:123: error: `itemmenuBarFont' undeclared (first use this function)
KTASettings.cpp:124: error: `KConfigSkeleton' has not been declared
KTASettings.cpp:124: error: `ItemFont' has not been declared
KTASettings.cpp:124: error: `QString' has not been declared
KTASettings.cpp:124: error: `mMenuBarFont' undeclared (first use this function)
KTASettings.cpp:124: error: `KGlobalSettings' has not been declared
KTASettings.cpp:124: error: `menuFont' undeclared (first use this function)
KTASettings.cpp:125: error: `QString' has not been declared
KTASettings.cpp: In destructor `KTASettings::~KTASettings()':
KTASettings.cpp:131: error: `staticKTASettingsDeleter' undeclared (first use this function)
make[1]: *** [KTASettings.o] Error 1
make[1]: Leaving directory `/tmp/KTrafficAnalyzer-0.3.8-1/settings'
make[1]: Entering directory `/tmp/KTrafficAnalyzer-0.3.8-1/stats'
gcc -c KTAStats.cpp -I/usr/lib/qt-3.3/include/ -I/usr/include/ -I/tmp/KTrafficAnalyzer-0.3.8-1
In file included from KTAStats.cpp:4:
KTAStats.h:6:29: kconfigskeleton.h: No such file or directory
In file included from KTAStats.cpp:4:
KTAStats.h:9: error: expected class-name before '{' token
KTAStats.h:12: error: expected `;' before '(' token
KTAStats.h:19: error: expected `,' or `...' before '&' token
KTAStats.h:20: error: ISO C++ forbids declaration of `QStringList' with no type
KTAStats.h:29: error: `QStringList' does not name a type
KTAStats.h:38: error: expected `,' or `...' before '&' token
KTAStats.h:39: error: ISO C++ forbids declaration of `QStringList' with no type
KTAStats.h:48: error: `QStringList' does not name a type
KTAStats.h:57: error: expected `,' or `...' before '&' token
KTAStats.h:58: error: ISO C++ forbids declaration of `QStringList' with no type
KTAStats.h:67: error: `QStringList' does not name a type
KTAStats.h:78: error: expected `)' before "configname"
KTAStats.h:83: error: `QStringList' does not name a type
KTAStats.h:84: error: `QStringList' does not name a type
KTAStats.h:85: error: `QStringList' does not name a type
KTAStats.h: In static member function `static void KTAStats::setDates(int)':
KTAStats.h:21: error: `self' undeclared (first use this function)
KTAStats.h:21: error: (Each undeclared identifier is reported only once for each function it appears in.)
KTAStats.h:21: error: `QString' has not been declared
KTAStats.h:21: error: `fromLatin1' undeclared (first use this function)
KTAStats.h:22: error: `v' undeclared (first use this function)
KTAStats.h: In static member function `static void KTAStats::setUploads(int)':
KTAStats.h:40: error: `self' undeclared (first use this function)
KTAStats.h:40: error: `QString' has not been declared
KTAStats.h:40: error: `fromLatin1' undeclared (first use this function)
KTAStats.h:41: error: `v' undeclared (first use this function)
KTAStats.h: In static member function `static void KTAStats::setDownloads(int)':
KTAStats.h:59: error: `self' undeclared (first use this function)
KTAStats.h:59: error: `QString' has not been declared
KTAStats.h:59: error: `fromLatin1' undeclared (first use this function)
KTAStats.h:60: error: `v' undeclared (first use this function)
KTAStats.h: In static member function `static void KTAStats::writeConfig()':
KTAStats.h:75: error: `KConfigSkeleton' has not been declared
KTAStats.h:75: error: expected `>' before '*' token
KTAStats.h:75: error: expected `(' before '*' token
KTAStats.h:75: error: expected primary-expression before '>' token
KTAStats.h:75: error: `self' undeclared (first use this function)
KTAStats.h:75: error: expected `)' before ';' token
KTAStats.cpp:6:28: kstaticdeleter.h: No such file or directory
KTAStats.cpp: At global scope:
KTAStats.cpp:9: error: expected init-declarator before '<' token
KTAStats.cpp:9: error: expected `,' or `;' before '<' token
KTAStats.cpp:11: error: `KTAStats*KTAStats::self' is not a static member of `class KTAStats'
KTAStats.cpp:11: error: `QString' was not declared in this scope
KTAStats.cpp:12: error: expected `,' or `;' before '{' token
KTAStats.cpp:21: error: expected `)' before "configname"
KTAStats.cpp:21: error: expected `,' or `;' before "configname"
KTAStats.cpp: In destructor `KTAStats::~KTAStats()':
KTAStats.cpp:41: error: `staticKTAStatsDeleter' undeclared (first use this function)
make[1]: *** [KTAStats.o] Error 1
make[1]: Leaving directory `/tmp/KTrafficAnalyzer-0.3.8-1/stats'
make[1]: Entering directory `/tmp/KTrafficAnalyzer-0.3.8-1/lib'
gcc -c dataPoint.cpp -I/usr/lib/qt-3.3/include/ -I/usr/include/ -I/tmp/KTrafficAnalyzer-0.3.8-1
gcc -c ringMemory.cpp -I/usr/lib/qt-3.3/include/ -I/usr/include/ -I/tmp/KTrafficAnalyzer-0.3.8-1
gcc -c TrafficInterface.cpp -I/usr/lib/qt-3.3/include/ -I/usr/include/ -I/tmp/KTrafficAnalyzer-0.3.8-1
In file included from /tmp/KTrafficAnalyzer-0.3.8-1/lib/SSHTrafficInterface.h:22,
from TrafficInterface.h:59,
from TrafficInterface.cpp:19:
/tmp/KTrafficAnalyzer-0.3.8-1/settings/KTASettings.h:6:29: kconfigskeleton.h: No such file or directory
In file included from /tmp/KTrafficAnalyzer-0.3.8-1/lib/SSHTrafficInterface.h:22,
from TrafficInterface.h:59,
from TrafficInterface.cpp:19:
/tmp/KTrafficAnalyzer-0.3.8-1/settings/KTASettings.h:9: error: expected class-name before '{' token
/tmp/KTrafficAnalyzer-0.3.8-1/settings/KTASettings.h:532: error: expected `,' or `...' before '&' token
/tmp/KTrafficAnalyzer-0.3.8-1/settings/KTASettings.h:533: error: ISO C++ forbids declaration of`QFont' with no type
/tmp/KTrafficAnalyzer-0.3.8-1/settings/KTASettings.h:542: error: `QFont' does not name a type
/tmp/KTrafficAnalyzer-0.3.8-1/settings/KTASettings.h:551: error: expected `,' or `...' before '&' token
/tmp/KTrafficAnalyzer-0.3.8-1/settings/KTASettings.h:552: error: ISO C++ forbids declaration of`QFont' with no type
/tmp/KTrafficAnalyzer-0.3.8-1/settings/KTASettings.h:561: error: `QFont' does not name a type
/tmp/KTrafficAnalyzer-0.3.8-1/settings/KTASettings.h:605: error: field `mUploadColor' has incomplete type
/tmp/KTrafficAnalyzer-0.3.8-1/settings/KTASettings.h:606: error: field `mDownloadColor' has incomplete type
/tmp/KTrafficAnalyzer-0.3.8-1/settings/KTASettings.h:607: error: field `mBackgroundColor' has incomplete type
/tmp/KTrafficAnalyzer-0.3.8-1/settings/KTASettings.h:608: error: field `mGridColor' has incomplete type
/tmp/KTrafficAnalyzer-0.3.8-1/settings/KTASettings.h:612: error: `QFont' does not name a type
/tmp/KTrafficAnalyzer-0.3.8-1/settings/KTASettings.h:613: error: `QFont' does not name a type
/tmp/KTrafficAnalyzer-0.3.8-1/settings/KTASettings.h: In static member function `static void KTASettings::setNoBorder(bool)':
/tmp/KTrafficAnalyzer-0.3.8-1/settings/KTASettings.h:21: error: 'class KTASettings' has no member named 'isImmutable'
/tmp/KTrafficAnalyzer-0.3.8-1/settings/KTASettings.h: In static member function `static void KTASettings::setAlwaysOnTop(bool)':
/tmp/KTrafficAnalyzer-0.3.8-1/settings/KTASettings.h:40: error: 'class KTASettings' has no member named 'isImmutable'
/tmp/KTrafficAnalyzer-0.3.8-1/settings/KTASettings.h: In static member function `static void KTASettings::setShowOnAllDesktops(bool)':
/tmp/KTrafficAnalyzer-0.3.8-1/settings/KTASettings.h:59: error: 'class KTASettings' has no member named 'isImmutable'
/tmp/KTrafficAnalyzer-0.3.8-1/settings/KTASettings.h: In static member function `static void KTASettings::setSkipTaskBar(bool)':
/tmp/KTrafficAnalyzer-0.3.8-1/settings/KTASettings.h:78: error: 'class KTASettings' has no member named 'isImmutable'
/tmp/KTrafficAnalyzer-0.3.8-1/settings/KTASettings.h: In static member function `static void KTASettings::setStartMinimized(bool)':
/tmp/KTrafficAnalyzer-0.3.8-1/settings/KTASettings.h:97: error: 'class KTASettings' has no member named 'isImmutable'
/tmp/KTrafficAnalyzer-0.3.8-1/settings/KTASettings.h: In static member function `static void KTASettings::setRememberPos(bool)':
/tmp/KTrafficAnalyzer-0.3.8-1/settings/KTASettings.h:116: error: 'class KTASettings' has no member named 'isImmutable'
/tmp/KTrafficAnalyzer-0.3.8-1/settings/KTASettings.h: In static member function `static void KTASettings::setRememberSize(bool)':
/tmp/KTrafficAnalyzer-0.3.8-1/settings/KTASettings.h:135: error: 'class KTASettings' has no member named 'isImmutable'
/tmp/KTrafficAnalyzer-0.3.8-1/settings/KTASettings.h: In static member function `static void KTASettings::setShowToolBar(bool)':
/tmp/KTrafficAnalyzer-0.3.8-1/settings/KTASettings.h:154: error: 'class KTASettings' has no member named 'isImmutable'
/tmp/KTrafficAnalyzer-0.3.8-1/settings/KTASettings.h: In static member function `static void KTASettings::setPosX(int)':
/tmp/KTrafficAnalyzer-0.3.8-1/settings/KTASettings.h:173: error: 'class KTASettings' has no member named 'isImmutable'
/tmp/KTrafficAnalyzer-0.3.8-1/settings/KTASettings.h: In static member function `static void KTASettings::setPosY(int)':
/tmp/KTrafficAnalyzer-0.3.8-1/settings/KTASettings.h:192: error: 'class KTASettings' has no member named 'isImmutable'
/tmp/KTrafficAnalyzer-0.3.8-1/settings/KTASettings.h: In static member function `static void KTASettings::setSizeX(int)':
/tmp/KTrafficAnalyzer-0.3.8-1/settings/KTASettings.h:211: error: 'class KTASettings' has no member named 'isImmutable'
/tmp/KTrafficAnalyzer-0.3.8-1/settings/KTASettings.h: In static member function `static void KTASettings::setSizeY(int)':
/tmp/KTrafficAnalyzer-0.3.8-1/settings/KTASettings.h:230: error: 'class KTASettings' has no member named 'isImmutable'
/tmp/KTrafficAnalyzer-0.3.8-1/settings/KTASettings.h: In static member function `static void KTASettings::setInterfacesSource(int)':
/tmp/KTrafficAnalyzer-0.3.8-1/settings/KTASettings.h:249: error: 'class KTASettings' has no member named 'isImmutable'
/tmp/KTrafficAnalyzer-0.3.8-1/settings/KTASettings.h: In static member function `static void KTASettings::setInterface(const QString&)':
/tmp/KTrafficAnalyzer-0.3.8-1/settings/KTASettings.h:268: error: 'class KTASettings' has no member named 'isImmutable'
/tmp/KTrafficAnalyzer-0.3.8-1/settings/KTASettings.h: In static member function `static void KTASettings::setMonitorTime(int)':
/tmp/KTrafficAnalyzer-0.3.8-1/settings/KTASettings.h:287: error: 'class KTASettings' has no member named 'isImmutable'
/tmp/KTrafficAnalyzer-0.3.8-1/settings/KTASettings.h: In static member function `static void KTASettings::setRefreshTime(int)':
/tmp/KTrafficAnalyzer-0.3.8-1/settings/KTASettings.h:306: error: 'class KTASettings' has no member named 'isImmutable'
/tmp/KTrafficAnalyzer-0.3.8-1/settings/KTASettings.h: In static member function `static void KTASettings::setAlwaysWriteStats(bool)':
/tmp/KTrafficAnalyzer-0.3.8-1/settings/KTASettings.h:325: error: 'class KTASettings' has no member named 'isImmutable'
/tmp/KTrafficAnalyzer-0.3.8-1/settings/KTASettings.h: In static member function `static void KTASettings::setSSHHost(const QString&)':
/tmp/KTrafficAnalyzer-0.3.8-1/settings/KTASettings.h:344: error: 'class KTASettings' has no member named 'isImmutable'
/tmp/KTrafficAnalyzer-0.3.8-1/settings/KTASettings.h: In static member function `static void KTASettings::setSSHUser(const QString&)':
/tmp/KTrafficAnalyzer-0.3.8-1/settings/KTASettings.h:363: error: 'class KTASettings' has no member named 'isImmutable'
/tmp/KTrafficAnalyzer-0.3.8-1/settings/KTASettings.h: In static member function `static void KTASettings::setSSHPass(const QString&)':
/tmp/KTrafficAnalyzer-0.3.8-1/settings/KTASettings.h:382: error: 'class KTASettings' has no member named 'isImmutable'
/tmp/KTrafficAnalyzer-0.3.8-1/settings/KTASettings.h: In static member function `static void KTASettings::setSSHParameter(const QString&)':
/tmp/KTrafficAnalyzer-0.3.8-1/settings/KTASettings.h:401: error: 'class KTASettings' has no member named 'isImmutable'
/tmp/KTrafficAnalyzer-0.3.8-1/settings/KTASettings.h: In static member function `static void KTASettings::setSSHDebug(bool)':
/tmp/KTrafficAnalyzer-0.3.8-1/settings/KTASettings.h:420: error: 'class KTASettings' has no member named 'isImmutable'
/tmp/KTrafficAnalyzer-0.3.8-1/settings/KTASettings.h: In static member function `static void KTASettings::setUploadColor(const QColor&)':
/tmp/KTrafficAnalyzer-0.3.8-1/settings/KTASettings.h:439: error: 'class KTASettings' has no member named 'isImmutable'
/tmp/KTrafficAnalyzer-0.3.8-1/settings/KTASettings.h:440: error: 'class KTASettings' has no member named 'mUploadColor'
/tmp/KTrafficAnalyzer-0.3.8-1/settings/KTASettings.h: In static member function `static QColor KTASettings::uploadColor()':
/tmp/KTrafficAnalyzer-0.3.8-1/settings/KTASettings.h:448: error: return type `struct QColor' isincomplete
/tmp/KTrafficAnalyzer-0.3.8-1/settings/KTASettings.h:449: error: 'class KTASettings' has no member named 'mUploadColor'
/tmp/KTrafficAnalyzer-0.3.8-1/settings/KTASettings.h: In static member function `static void KTASettings::setDownloadColor(const QColor&)':
/tmp/KTrafficAnalyzer-0.3.8-1/settings/KTASettings.h:458: error: 'class KTASettings' has no member named 'isImmutable'
/tmp/KTrafficAnalyzer-0.3.8-1/settings/KTASettings.h:459: error: 'class KTASettings' has no member named 'mDownloadColor'
/tmp/KTrafficAnalyzer-0.3.8-1/settings/KTASettings.h: In static member function `static QColor KTASettings::downloadColor()':
/tmp/KTrafficAnalyzer-0.3.8-1/settings/KTASettings.h:467: error: return type `struct QColor' isincomplete
/tmp/KTrafficAnalyzer-0.3.8-1/settings/KTASettings.h:468: error: 'class KTASettings' has no member named 'mDownloadColor'
/tmp/KTrafficAnalyzer-0.3.8-1/settings/KTASettings.h: In static member function `static void KTASettings::setBackgroundColor(const QColor&)':
/tmp/KTrafficAnalyzer-0.3.8-1/settings/KTASettings.h:477: error: 'class KTASettings' has no member named 'isImmutable'
/tmp/KTrafficAnalyzer-0.3.8-1/settings/KTASettings.h:478: error: 'class KTASettings' has no member named 'mBackgroundColor'
/tmp/KTrafficAnalyzer-0.3.8-1/settings/KTASettings.h: In static member function `static QColor KTASettings::backgroundColor()':
/tmp/KTrafficAnalyzer-0.3.8-1/settings/KTASettings.h:486: error: return type `struct QColor' isincomplete
/tmp/KTrafficAnalyzer-0.3.8-1/settings/KTASettings.h:487: error: 'class KTASettings' has no member named 'mBackgroundColor'
/tmp/KTrafficAnalyzer-0.3.8-1/settings/KTASettings.h: In static member function `static void KTASettings::setGridColor(const QColor&)':
/tmp/KTrafficAnalyzer-0.3.8-1/settings/KTASettings.h:496: error: 'class KTASettings' has no member named 'isImmutable'
/tmp/KTrafficAnalyzer-0.3.8-1/settings/KTASettings.h:497: error: 'class KTASettings' has no member named 'mGridColor'
/tmp/KTrafficAnalyzer-0.3.8-1/settings/KTASettings.h: In static member function `static QColor KTASettings::gridColor()':
/tmp/KTrafficAnalyzer-0.3.8-1/settings/KTASettings.h:505: error: return type `struct QColor' isincomplete
/tmp/KTrafficAnalyzer-0.3.8-1/settings/KTASettings.h:506: error: 'class KTASettings' has no member named 'mGridColor'
/tmp/KTrafficAnalyzer-0.3.8-1/settings/KTASettings.h: In static member function `static void KTASettings::setSbUsesBGColor(bool)':
/tmp/KTrafficAnalyzer-0.3.8-1/settings/KTASettings.h:515: error: 'class KTASettings' has no member named 'isImmutable'
/tmp/KTrafficAnalyzer-0.3.8-1/settings/KTASettings.h: In static member function `static void KTASettings::setStatusBarFont(int)':
/tmp/KTrafficAnalyzer-0.3.8-1/settings/KTASettings.h:534: error: 'class KTASettings' has no member named 'isImmutable'
/tmp/KTrafficAnalyzer-0.3.8-1/settings/KTASettings.h:535: error: 'class KTASettings' has no member named 'mStatusBarFont'
/tmp/KTrafficAnalyzer-0.3.8-1/settings/KTASettings.h:535: error: `v' undeclared (first use thisfunction)
/tmp/KTrafficAnalyzer-0.3.8-1/settings/KTASettings.h:535: error: (Each undeclared identifier isreported only once for each function it appears in.)
/tmp/KTrafficAnalyzer-0.3.8-1/settings/KTASettings.h: In static member function `static void KTASettings::setMenuBarFont(int)':
/tmp/KTrafficAnalyzer-0.3.8-1/settings/KTASettings.h:553: error: 'class KTASettings' has no member named 'isImmutable'
/tmp/KTrafficAnalyzer-0.3.8-1/settings/KTASettings.h:554: error: 'class KTASettings' has no member named 'mMenuBarFont'
/tmp/KTrafficAnalyzer-0.3.8-1/settings/KTASettings.h:554: error: `v' undeclared (first use thisfunction)
/tmp/KTrafficAnalyzer-0.3.8-1/settings/KTASettings.h: In static member function `static void KTASettings::writeConfig()':
/tmp/KTrafficAnalyzer-0.3.8-1/settings/KTASettings.h:569: error: `KConfigSkeleton' has not beendeclared
/tmp/KTrafficAnalyzer-0.3.8-1/settings/KTASettings.h:569: error: expected `>' before '*' token
/tmp/KTrafficAnalyzer-0.3.8-1/settings/KTASettings.h:569: error: expected `(' before '*' token
/tmp/KTrafficAnalyzer-0.3.8-1/settings/KTASettings.h:569: error: expected primary-expression before '>' token
/tmp/KTrafficAnalyzer-0.3.8-1/settings/KTASettings.h:569: error: expected `)' before ';' token
In file included from /tmp/KTrafficAnalyzer-0.3.8-1/lib/SSHTrafficInterface.h:25,
from TrafficInterface.h:59,
from TrafficInterface.cpp:19:
/tmp/KTrafficAnalyzer-0.3.8-1/lib/remoteRead.h:26:22: kprocess.h: No such file or directory
/tmp/KTrafficAnalyzer-0.3.8-1/lib/remoteRead.h:27:18: kpty.h: No such file or directory
In file included from /tmp/KTrafficAnalyzer-0.3.8-1/lib/SSHTrafficInterface.h:25,
from TrafficInterface.h:59,
from TrafficInterface.cpp:19:
/tmp/KTrafficAnalyzer-0.3.8-1/lib/remoteRead.h: At global scope:
/tmp/KTrafficAnalyzer-0.3.8-1/lib/remoteRead.h:30: error: expected class-name before '{' token
make[1]: *** [TrafficInterface.o] Error 1
make[1]: Leaving directory `/tmp/KTrafficAnalyzer-0.3.8-1/lib'
make: *** [all] Error 2
[root@server KTrafficAnalyzer-0.3.8-1]#
Linux Addicted
AcidEYE
Havaldaar
 
Posts: 115
Joined: Mon Feb 28, 2005 5:41 pm
WLM: a_flame@msn.com
Yahoo Messenger: acid_eye69@yahoo.com
AOL: none
Location: Lahore (Pakistan)

Re:

Postby LinuxFreaK » Sat Jul 14, 2007 7:16 am

Dear AcidEYE,
Salam,

You need to install KDE Development Package.

# rpm -ivh kdelibs3-devel.x.y.z.rpm

Best Regards.
Farrukh Ahmed
LinuxFreaK
Site Admin
 
Posts: 5132
Joined: Fri May 02, 2003 10:24 am
ICQ: 82075802
Website: http://www.linuxpakistan.net/wiki/index.php?pagename=LinuxFreak
WLM: f4fahmed@hotmail.com
Yahoo Messenger: f4fahmed@yahoo.com
AOL: linuxpakistan@aol.com
Location: Karachi

Postby AcidEYE » Sat Jul 14, 2007 8:40 pm

[root@server RPMS]# rpm -ivh kdelibs-3.3.1-3.2.i386.rpm kdelibs-devel-3.3.1-3.2.i386.rpm
warning: kdelibs-3.3.1-3.2.i386.rpm: V3 DSA signature: NOKEY, key ID db42a60e
Preparing... ########################################### [100%]
package kdelibs-3.3.1-3.2 is already installed
package kdelibs-devel-3.3.1-3.2 is already installed
[root@server RPMS]#
Linux Addicted
AcidEYE
Havaldaar
 
Posts: 115
Joined: Mon Feb 28, 2005 5:41 pm
WLM: a_flame@msn.com
Yahoo Messenger: acid_eye69@yahoo.com
AOL: none
Location: Lahore (Pakistan)

Postby lambda » Sat Jul 14, 2007 10:24 pm

have you read the installation docs? perhaps there's a step you missed.
lambda
Major General
 
Posts: 3452
Joined: Tue May 27, 2003 7:04 pm
Website: http://www.hungry.com/~fn/
Location: Lahore

Postby AcidEYE » Sat Jul 14, 2007 10:35 pm

As Salam U ALikum,

sir doc file said installation is easy just start with make and then make install thats all
Linux Addicted
AcidEYE
Havaldaar
 
Posts: 115
Joined: Mon Feb 28, 2005 5:41 pm
WLM: a_flame@msn.com
Yahoo Messenger: acid_eye69@yahoo.com
AOL: none
Location: Lahore (Pakistan)

Postby lambda » Sun Jul 15, 2007 7:35 pm

if you have kconfigskeleton.h on your system, then the makefile probably needs some adjustment. if you don't have it, something's wrong with your rpms, because it's supposed to be in kselibs-devel.
lambda
Major General
 
Posts: 3452
Joined: Tue May 27, 2003 7:04 pm
Website: http://www.hungry.com/~fn/
Location: Lahore

Re:

Postby LinuxFreaK » Mon Jul 16, 2007 8:01 am

Dear AcidEYE,
Salam,

Try following command and let us know what you will get.

# rpm -ql kdelibs-devel | grep kconfigskeleton.h

Best Regards.
Farrukh Ahmed
LinuxFreaK
Site Admin
 
Posts: 5132
Joined: Fri May 02, 2003 10:24 am
ICQ: 82075802
Website: http://www.linuxpakistan.net/wiki/index.php?pagename=LinuxFreak
WLM: f4fahmed@hotmail.com
Yahoo Messenger: f4fahmed@yahoo.com
AOL: linuxpakistan@aol.com
Location: Karachi

Postby AcidEYE » Tue Jul 17, 2007 12:11 pm

[root@server ~]# rpm -ql kdelibs-devel | grep kconfigskeleton.h
/usr/include/kde/kconfigskeleton.h
[root@server ~]#
Linux Addicted
AcidEYE
Havaldaar
 
Posts: 115
Joined: Mon Feb 28, 2005 5:41 pm
WLM: a_flame@msn.com
Yahoo Messenger: acid_eye69@yahoo.com
AOL: none
Location: Lahore (Pakistan)

Re:

Postby LinuxFreaK » Mon Jul 23, 2007 10:21 am

Dear AcidEYE,
Salam,

It should work then.

Best Regards.
Farrukh Ahmed
LinuxFreaK
Site Admin
 
Posts: 5132
Joined: Fri May 02, 2003 10:24 am
ICQ: 82075802
Website: http://www.linuxpakistan.net/wiki/index.php?pagename=LinuxFreak
WLM: f4fahmed@hotmail.com
Yahoo Messenger: f4fahmed@yahoo.com
AOL: linuxpakistan@aol.com
Location: Karachi


Return to “%s” Installation

Who is online

Users browsing this forum: No registered users and 2 guests